Android OS Forum banner
1 - 20 of 37 Posts

·
Android Apprentice
Joined
·
44 Posts
Discussion Starter · #1 ·
First, I wanna say hey, because this is my first post here. I came from the t3hh4xx0r site and have been working on a mod of omfgb.

Now for my problem (I think this is the right section to be posting):

I can compile the regular omfgb fine, but when I add my own bits and pieces (can be found here), it gives me the error that I've pasted over here: http://pastebin.com/Q3PnXG1b.

If anyone can help me figure this one out, it would be extremely appreciated.
 

·
Developer
Joined
·
200 Posts
Try a make clean. Then make again. The error you have received is unrelated to the launcher. Weird.

Sent from my Incredible using Tapatalk
 

·
Android Apprentice
Joined
·
44 Posts
Discussion Starter · #8 ·
Ok, that worked- I think. I didn't get the same error & it did take a while, but I still got a "Waiting for unfinished jobs" message. Right before it was:

Code:
<br />
make: *** [out/host/common/obj/JAVA_LIBRARIES/core-hostdex_intermediates/classes.jar] Error 41<br />
 

·
Developer
Joined
·
200 Posts
If you used more than one thread to compile you may have to look upwards a decent amount. The error should be above those lines.

Sent from my Incredible using Tapatalk
 

·
Android Apprentice
Joined
·
44 Posts
Discussion Starter · #10 ·
I recompiled today and put up the entire piece that starts getting weird over here: http://pastebin.com/fyM03rK1.

Not expecting anyone to go through that junk, I took out the sections that had the word "error" in them.

Code:
<br />
echo out/host/linux-x86/obj/STATIC_LIBRARIES/libpng_intermediates/png.o out/host/linux-x86/obj/STATIC_LIBRARIES/libpng_intermediates/pngerror.o<br />
Code:
<br />
out/host/linux-x86/obj/STATIC_LIBRARIES/libtinyxml_intermediates/tinyxmlerror.o out/host/linux-x86/obj/STATIC_LIBRARIES/libtinyxml_intermediates/tinystr.o | xargs ar crsP  out/host/linux-x86/obj/STATIC_LIBRARIES/libtinyxml_intermediates/libtinyxml.a<br />
Code:
<br />
out/host/linux-x86/obj/STATIC_LIBRARIES/libelf_intermediates/libelf/elf_error.o<br />
Code:
<br />
make: *** [out/host/linux-x86/obj/EXECUTABLES/adb_intermediates/adb] Error 1<br />
I personally can't find anything that make sense, but if you have ideas...
 

·
Developer
Joined
·
200 Posts
Have you fallowd this guide http://source.android.com/source/initializing.html upto installing pacakges. You might not have all required packages.

Oh have you done. '. Build/envsetup.sh' and 'lunch'?

If all else fails you can put what youve done in a dir that is not part of your android build system. Delete the whole build system folder and start again. Repo sync. Etc.. I had something kind of like the same error. It was the only thing that fixed it for me

Sent from my Incredible using Tapatalk
 

·
Android Apprentice
Joined
·
44 Posts
Discussion Starter · #14 ·
I'm wondering something: I did redownload it last night, and I tried compiling today, but I'm still getting errors.However, my laptop has been randomly rebooting (complete different problem), and it has during compiling. So would stopping it mid-compile screw something up?
 

·
Android Apprentice
Joined
·
44 Posts
Discussion Starter · #19 ·
Just installed EVERY SINGLE PACKAGE in the http://source.android.com/source/initializing.html site- even the ones for the older versions and 32 bit computers. Reran the compile and now get THIS error:

Code:
<br />
arm-eabi-g++: Internal error: Killed (program cc1plus)<br />
Please submit a full bug report.<br />
See <http://gcc.gnu.org/bugs.html> for instructions.<br />
make: *** [out/target/product/inc/obj/STATIC_LIBRARIES/libwebcore_intermediates/WebCore/editing/DeleteFromTextNodeCommand.o] Error 1<br />
make: *** Waiting for unfinished jobs....<br />
target thumb C++: libwebcore <= external/webkit/WebCore/editing/DeleteSelectionCommand.cpp<br />
Killed<br />
 
1 - 20 of 37 Posts
Top